BDBM139952 US8901087, 97
SMILES CCCNC1=N[C@H]2[C@H](O[C@H]([C@@H](O)C(F)(F)F)[C@@H](O)[C@@H]2O)S1
InChI Key InChIKey=MGEBPZJPXKZSNB-NTXXKDEISA-N
Data  1 KI
  Tab Delimited (TSV)   2D SDfile   Computed 3D by Vconf -m prep SDfile
Find this compound or compounds like it in BindingDB:
Activity Spreadsheet -- Enzyme Inhibition Constant Data from BindingDB
Found 1 hit for monomerid = 139952
TargetProtein O-GlcNAcase(Homo sapiens (Human))
Merck Sharp & Dohme
US Patent
LigandPNGBDBM139952(US8901087, 97)
Affinity DataKi:  0.170nM ΔG°:  -13.3kcal/molepH: 7.0 T: 2°C. Assay description: Enzymatic reactions are carried out in a reaction containing 50 mM NaH2PO4, 100 mM NaCl and 0.1% BSA (pH 7.0) using 2 mM 4-Methylumbelliferyl N-acety...
In DepthDetails US Patent