BDBM14135 2-ketobenzothiazole 73::N-({[(2S)-1-(1,3-benzothiazol-2-yl)-5-carbamimidamido-1-oxopentan-2-yl]carbamoyl}methyl)-N-[2-methyl-2-(3-methylphenyl)propyl]-3-phenylpropanamide
SMILES [#6]-c1cccc(c1)C([#6])([#6])[#6]-[#7](-[#6]-[#6](=O)-[#7]-[#6@@H](-[#6]-[#6]-[#6]\[#7]=[#6](\[#7])-[#7])-[#6](=O)-c1nc2ccccc2s1)-[#6](=O)-[#6]-[#6]-c1ccccc1
InChI Key InChIKey=URLAUDJYECFULL-NDEPHWFRSA-N
Data  2 KI  1 IC50
  Tab Delimited (TSV)   2D SDfile   Computed 3D by Vconf -m prep SDfile
Find this compound or compounds like it in BindingDB:
Activity Spreadsheet -- Enzyme Inhibition Constant Data from BindingDB
Found 2 hits for monomerid = 14135
TargetSerine protease 1(Bos taurus (bovine))
Johnson & Johnson Pharmaceutical
LigandPNGBDBM14135(2-ketobenzothiazole 73 | N-({[(2S)-1-(1,3-benzothi...)
Affinity DataKi:  57nM. Assay description: Trypsin-catalyzed hydrolysis rates were measured spectrophotometrically using bovine trypsin, a chromogenic substrate in aqueous buffer, and a microp...
In DepthDetails ArticlePubMed
TargetProthrombin(Homo sapiens (Human))
Johnson & Johnson Pharmaceutical
LigandPNGBDBM14135(2-ketobenzothiazole 73 | N-({[(2S)-1-(1,3-benzothi...)
Affinity DataKi:  400nM IC50:  4.00E+3nM. Assay description: Thrombin-catalyzed hydrolysis rates were measured spectrophotometrically using human alpha-thrombin, a chromogenic substrate in aqueous buffer, and a...
In DepthDetails ArticlePubMed