BDBM14211 3-(carboxymethoxy)thieno[2,3-b]pyridine-2-carboxylic acid::pyridothiophene inhibitor 1
SMILES OC(=O)COc1c(sc2ncccc12)C(O)=O
InChI Key InChIKey=JGZSWLHKOMFYHS-UHFFFAOYSA-N
Data  1 KI
PDB links: 1 PDB ID matches this monomer.
  Tab Delimited (TSV)   2D SDfile   Computed 3D by Vconf -m prep SDfile
Find this compound or compounds like it in BindingDB:
Activity Spreadsheet -- Enzyme Inhibition Constant Data from BindingDB
Found 1 hit for monomerid = 14211
TargetTyrosine-protein phosphatase non-receptor type 1 [1-298](Homo sapiens (Human))
Wyeth Research
LigandPNGBDBM14211(3-(carboxymethoxy)thieno[2,3-b]pyridine-2-carboxyl...)
Affinity DataKi:  2.30E+5nM ΔG°:  -4.91kcal/molepH: 7.4 T: 2°C. Assay description: The enzymatic assay was carried out at room temperature in 96-well plates. The initial rate of PTPase-catalyzed hydrolysis of p-nitrophenol phosphate...