BDBM144966 US8952157, 148::US9303025, 148
SMILES CC1(C)CCC(CN2CCN(CC2)c2ccc(C(=O)NS(=O)(=O)c3ccc(NCCCN4CCOCC4)c(c3)[N+]([O-])=O)c(Oc3cccc(Cl)c3F)c2)=C(C1)c1ccc(Cl)cc1
InChI Key InChIKey=GYUQTRDZRKVKPI-UHFFFAOYSA-N
Data  2 KI
  Tab Delimited (TSV)   2D SDfile   Computed 3D by Vconf -m prep SDfile
Find this compound or compounds like it in BindingDB:
Activity Spreadsheet -- Enzyme Inhibition Constant Data from BindingDB
Found 2 hits for monomerid = 144966
TargetApoptosis regulator Bcl-2(Homo sapiens (Human))
Abbvie
US Patent
LigandPNGBDBM144966(US8952157, 148 | US9303025, 148)
Affinity DataKi:  0.106nM ΔG°:  -13.6kcal/moleT: 2°C. Assay description: Representative compounds were serially diluted in dimethyl sulfoxide (DMSO) starting at 50 μM (2× starting concentration; 10% DMSO) and 10 μ...
In DepthDetails US Patent
TargetApoptosis regulator Bcl-2(Homo sapiens (Human))
Abbvie
US Patent
LigandPNGBDBM144966(US8952157, 148 | US9303025, 148)
Affinity DataKi:  0.106nM ΔG°:  -13.6kcal/moleT: 2°C. Assay description: Representative compounds were serially diluted in dimethyl sulfoxide (DMSO) starting at 50 uM (2x starting concentration; 10% DMSO) and 10 uL were tr...
In DepthDetails US Patent