BDBM14649 (3Z)-6-(4-hydroxy-3-methoxyphenyl)-3-(1H-pyrrol-2-ylmethylidene)-2,3-dihydro-1H-indol-2-one::indolinone analog 13
SMILES COc1cc(ccc1O)-c1ccc2\C(=C\c3ccc[nH]3)C(=O)Nc2c1
InChI Key InChIKey=AYSXURJZVXBSRV-WJDWOHSUSA-N
Data  1 KI  2 IC50
PDB links: 1 PDB ID matches this monomer.
  Tab Delimited (TSV)   2D SDfile   Computed 3D by Vconf -m prep SDfile
Find this compound or compounds like it in BindingDB:
Activity Spreadsheet -- Enzyme Inhibition Constant Data from BindingDB
Found 3 hits for monomerid = 14649
TargetSerine/threonine-protein kinase Chk1(Homo sapiens (Human))
Abbott Laboratories
Curated by ChEMBL
LigandPNGBDBM14649((3Z)-6-(4-hydroxy-3-methoxyphenyl)-3-(1H-pyrrol-2-...)
Affinity DataKi:  32nM. Assay description: Inhibition of Chk1
TargetSerine/threonine-protein kinase Chk1(Homo sapiens (Human))
Abbott Laboratories
Curated by ChEMBL
LigandPNGBDBM14649((3Z)-6-(4-hydroxy-3-methoxyphenyl)-3-(1H-pyrrol-2-...)
Affinity DataIC50:  7nMpH: 7.4 T: 2°C. Assay description: Chk1 kinase activity was assayed in reaction buffer containing substrate, enzyme, and inhibitor in the presence of 5uM ATP/[gamma-33P] ATP. 33P incor...
TargetSerine/threonine-protein kinase Chk1(Homo sapiens (Human))
Abbott Laboratories
Curated by ChEMBL
LigandPNGBDBM14649((3Z)-6-(4-hydroxy-3-methoxyphenyl)-3-(1H-pyrrol-2-...)
Affinity DataIC50:  7nM. Assay description: Inhibition of human recombinant GST-Chk1after 30 mins