BDBM150237 US8980929, Example Compound 5
SMILES N[C@H]1C[C@H](CCO[C@@H]1c1cc(F)ccc1F)N1Cc2[nH]nc(C(N)=O)c2C1
InChI Key
Data  1 IC50
  Tab Delimited (TSV)   2D SDfile   Computed 3D by Vconf -m prep SDfile
Find this compound or compounds like it in BindingDB:
Activity Spreadsheet -- Enzyme Inhibition Constant Data from BindingDB
Found 1 hit for monomerid = 150237
TargetDipeptidyl peptidase 4(Homo sapiens (Human))
Merck Sharp & Dohme
US Patent
LigandPNGBDBM150237(US8980929, Example Compound 5)
Affinity DataIC50:  2.60nMpH: 7.5Assay Description:A continuous fluorometric assay is employed with the substrate Gly-Pro-AMC, which is cleaved by DPP-4 to release the fluorescent AMC leaving group. T...
In DepthDetails US Patent