BDBM15197 US8846929, 233
SMILES [H][C@]12CC[C@]([H])(C[C@@]([H])(C1)n1c3ccccc3nc(C(=O)Nc3nc(CC(O)=O)cs3)c1=O)N2C1CCCCCCC1
InChI Key InChIKey=NREXELYSNQBVSL-ZBYYUNFXSA-N
Data  1 KI
PDB links: 3 PDB IDs match this monomer.
  Tab Delimited (TSV)   2D SDfile   Computed 3D by Vconf -m prep SDfile
Find this compound or compounds like it in BindingDB:
Activity Spreadsheet -- Enzyme Inhibition Constant Data from BindingDB
Found 1 hit for monomerid = 15197
TargetOpioid growth factor receptor-like protein 1(Homo sapiens (Human))
Purdue Pharma
US Patent
LigandPNGBDBM15197(US8846929, 233)
Affinity DataKi:  144nMpH: 7.4Assay Description:Radioligand binding assays (screening and dose-displacement) used 0.1nM [3H]-nociceptin (NEN; 87.7 Cl/nimole) with 10-20 ug membrane protein in a fin...
Ligand InfoPC cidPC sidPDB
In DepthDetails US Patent