BDBM15246 1-(5-Chloro-2-methoxyphenyl)-3-[6-[1-(dimethylamino)propan-::3-(5-chloro-2-methoxyphenyl)-1-(6-{[1-(dimethylamino)propan-2-yl]oxy}pyrazin-2-yl)urea::macrocyclic inhibitor 4
SMILES COc1ccc(Cl)cc1NC(=O)Nc1cncc(OC(C)CN(C)C)n1
InChI Key InChIKey=GIAYFZLMPSVQDV-UHFFFAOYSA-N
Data  1 KI  1 IC50
PDB links: 1 PDB ID matches this monomer.
  Tab Delimited (TSV)   2D SDfile   Computed 3D by Vconf -m prep SDfile
Find this compound or compounds like it in BindingDB:
Activity Spreadsheet -- Enzyme Inhibition Constant Data from BindingDB
Found 2 hits for monomerid = 15246
TargetSerine/threonine-protein kinase Chk1(Homo sapiens (Human))
Abbott Laboratories
Curated by ChEMBL
LigandPNGBDBM15246(1-(5-Chloro-2-methoxyphenyl)-3-[6-[1-(dimethylamin...)
Affinity DataKi:  20nM. Assay description: Inhibition of Chk1
TargetSerine/threonine-protein kinase Chk1(Homo sapiens (Human))
Abbott Laboratories
Curated by ChEMBL
LigandPNGBDBM15246(1-(5-Chloro-2-methoxyphenyl)-3-[6-[1-(dimethylamin...)
Affinity DataIC50:  22nMpH: 7.4 T: 2°C. Assay description: Chk1 kinase activity was assayed in reaction buffer containing substrate, enzyme, and inhibitor in the presence of 5uM ATP/[gamma-33P] ATP. 33P incor...