BDBM154003 US8999981, F59
SMILES C[C@@H]1CN([C@@H](C)CN1CC1CCOCC1)C(=O)N1Cc2c(NC(=O)Cc3c(C)noc3C)n[nH]c2C1(C)C
InChI Key
Data  1 KI
  Tab Delimited (TSV)   2D SDfile   Computed 3D by Vconf -m prep SDfile
Find this compound or compounds like it in BindingDB:
Activity Spreadsheet -- Enzyme Inhibition Constant Data from BindingDB
Found 1 hit for monomerid = 154003
TargetProtein kinase C beta type(Homo sapiens (Human))
Pfizer
US Patent
LigandPNGBDBM154003(US8999981, F59)
Affinity DataKi:  20nM ΔG°:  -10.7kcal/molepH: 7.4 T: 2°C. Assay description: Protein Kinase C beta 2 (PKC beta II) catalyzes the production of ADP from ATP that accompanies the phosphoryl transfer to the PKC Pseudosubstrate pe...
In DepthDetails US Patent