BDBM155132 US9000184, 5, isomer 2
SMILES CO[C@H]1CC[C@@]2(CC1)CCc1ccc(Br)cc1C21N=C(C)C(N)=N1
InChI Key InChIKey=HTWVAHYYWZCEOA-CVJHCREESA-N
Data  1 IC50
  Tab Delimited (TSV)   2D SDfile   Computed 3D by Vconf -m prep SDfile
Find this compound or compounds like it in BindingDB:
Activity Spreadsheet -- Enzyme Inhibition Constant Data from BindingDB
Found 1 hit for monomerid = 155132
TargetBeta-secretase 1(Homo sapiens (Human))
Astrazeneca
US Patent
LigandPNGBDBM155132(US9000184, 5, isomer 2)
Affinity DataIC50:  8.92E+3nMpH: 2.5Assay Description:The beta -secretase enzyme used in the TR-FRET is prepared as follows:The cDNA for the soluble part of the human beta -Secretase (AA 1-AA 460) was cl...
In DepthDetails US Patent