BDBM155153 US9006187, 29
SMILES Cc1cc(sc1Cc1ccc(F)cc1)[C@@H]1O[C@H](CO)[C@@H](O)[C@H](O)[C@H]1O
InChI Key InChIKey=DPAMOFLLEAYFMO-CUWKQTPXSA-N
Data  1 IC50
  Tab Delimited (TSV)   2D SDfile   Computed 3D by Vconf -m prep SDfile
Find this compound or compounds like it in BindingDB:
Activity Spreadsheet -- Enzyme Inhibition Constant Data from BindingDB
Found 1 hit for monomerid = 155153
TargetSodium/glucose cotransporter 2(Homo sapiens (Human))
Green Cross
US Patent
LigandPNGBDBM155153(US9006187, 29)
Affinity DataIC50: >1.00E+4nMpH: 7.4 T: 2°C. Assay description: For sodium-dependent glucose transport assay, cells expressing hSGLT2 were seeded into a 96-well culture plate at a density of 5x104 cells/well in RP...
In DepthDetails US Patent