BDBM155257 US9006244, E2a::US9814715, Example 2, isomer 1
SMILES CC(C)[C@H]1N(CCn2c1nc1cc(CO)c(cc21)S(C)(=O)=O)c1nccc(n1)C(F)(F)F
InChI Key InChIKey=CABUZECPUSGGRX-QGZVFWFLSA-N
Data  4 KI
  Tab Delimited (TSV)   2D SDfile   Computed 3D by Vconf -m prep SDfile
Find this compound or compounds like it in BindingDB:
Activity Spreadsheet -- Enzyme Inhibition Constant Data from BindingDB
Found 4 hits for monomerid = 155257
TargetOxysterols receptor LXR-beta(Homo sapiens (Human))
Vitae Pharmaceuticals
US Patent
LigandPNGBDBM155257(US9006244, E2a | US9814715, Example 2, isomer 1)
Affinity DataKi:  20nM. Assay description: Compounds of the invention were assessed in a competition binding assay where different concentrations of compounds were incubated with the LXR ligan...
In DepthDetails US Patent
TargetOxysterols receptor LXR-beta(Homo sapiens (Human))
Vitae Pharmaceuticals
US Patent
LigandPNGBDBM155257(US9006244, E2a | US9814715, Example 2, isomer 1)
Affinity DataKi:  20nM. Assay description: Compounds of the invention were assessed in a competition binding assay where different concentrations of compounds were incubated with the LXR ligan...
In DepthDetails US Patent
TargetOxysterols receptor LXR-alpha(Homo sapiens (Human))
Vitae Pharamceuticals
US Patent
LigandPNGBDBM155257(US9006244, E2a | US9814715, Example 2, isomer 1)
Affinity DataKi:  318nM. Assay description: Compounds of the invention were assessed in a competition binding assay where different concentrations of compounds were incubated with the LXR ligan...
In DepthDetails US Patent
TargetOxysterols receptor LXR-alpha(Homo sapiens (Human))
Vitae Pharamceuticals
US Patent
LigandPNGBDBM155257(US9006244, E2a | US9814715, Example 2, isomer 1)
Affinity DataKi:  318nM. Assay description: Compounds of the invention were assessed in a competition binding assay where different concentrations of compounds were incubated with the LXR ligan...
In DepthDetails US Patent