BDBM15614 N,N-dimethyl-4-(4-phenyl-1H-pyrazol-3-yl)-1H-pyrrole-2-carboxamide::Pyrrole Carboxamide Analog 1
SMILES CN(C)C(=O)c1cc(c[nH]1)-c1n[nH]cc1-c1ccccc1
InChI Key InChIKey=OPBUUQBZKJSWTN-UHFFFAOYSA-N
Data  2 KI
PDB links: 1 PDB ID matches this monomer.
  Tab Delimited (TSV)   2D SDfile   Computed 3D by Vconf -m prep SDfile
Find this compound or compounds like it in BindingDB:
Activity Spreadsheet -- Enzyme Inhibition Constant Data from BindingDB
Found 2 hits for monomerid = 15614
TargetMitogen-activated protein kinase 1(Homo sapiens (Human))
Vertex Pharmaceuticals
LigandPNGBDBM15614(N,N-dimethyl-4-(4-phenyl-1H-pyrazol-3-yl)-1H-pyrro...)
Affinity DataKi:  2.30E+3nM ΔG°:  -7.82kcal/molepH: 7.5 T: 2°C. Assay description: A coupled spectrophotometric assay was used in which ADP generated by ERK2 was converted to ATP by pyruvate kinase with the production of pyruvate fr...
TargetMitogen-activated protein kinase 10(Homo sapiens (Human))
Vertex Pharmaceuticals
LigandPNGBDBM15614(N,N-dimethyl-4-(4-phenyl-1H-pyrazol-3-yl)-1H-pyrro...)
Affinity DataKi: >4.00E+3nM. Assay description: A coupled spectrophotometric assay was used in which ADP generated by JNK3 was converted to ATP by pyruvate kinase with the production of pyruvate fr...
In DepthDetails ArticlePubMed