BDBM15918 2-pyridinecarboxamide deriv. 12::4-Amino-5-chloro-6-ethoxy-pyridine-2-carboxylic acid 4-methanesulfonyl-benzylamide::4-amino-5-chloro-6-ethoxy-N-[(4-methanesulfonylphenyl)methyl]pyridine-2-carboxamide::CHEMBL377383
SMILES CCOc1nc(cc(N)c1Cl)C(=O)NCc1ccc(cc1)S(C)(=O)=O
InChI Key InChIKey=ZVDDPXIWKBBCQE-UHFFFAOYSA-N
Data  4 IC50
  Tab Delimited (TSV)   2D SDfile   Computed 3D by Vconf -m prep SDfile
Find this compound or compounds like it in BindingDB:
Activity Spreadsheet -- Enzyme Inhibition Constant Data from BindingDB
Found 4 hits for monomerid = 15918
TargetMitogen-activated protein kinase 8(Homo sapiens (Human))
Abbott Laboratories
LigandPNGBDBM15918(2-pyridinecarboxamide deriv. 12 | 4-Amino-5-chloro...)
Affinity DataIC50:  24nMpH: 7.2 T: 2°C. Assay description: In vitro substrate phosphorylation using purified recombinant JNK, was incubated with substrate, and test compounds in the presence of 5uM ATP/ [gamm...
In DepthDetails ArticlePubMed
TargetMitogen-activated protein kinase 8(Homo sapiens (Human))
Abbott Laboratories
LigandPNGBDBM15918(2-pyridinecarboxamide deriv. 12 | 4-Amino-5-chloro...)
Affinity DataIC50:  24nM. Assay description: Inhibition of JNK1
In DepthDetails ArticlePubMed
TargetMitogen-activated protein kinase 9(Homo sapiens (Human))
Abbott Laboratories
Curated by ChEMBL
LigandPNGBDBM15918(2-pyridinecarboxamide deriv. 12 | 4-Amino-5-chloro...)
Affinity DataIC50:  74nM. Assay description: Inhibition of JNK2
In DepthDetails ArticlePubMed
TargetMitogen-activated protein kinase 9(Homo sapiens (Human))
Abbott Laboratories
Curated by ChEMBL
LigandPNGBDBM15918(2-pyridinecarboxamide deriv. 12 | 4-Amino-5-chloro...)
Affinity DataIC50:  74nM. Assay description: In vitro substrate phosphorylation using purified recombinant JNK, was incubated with substrate, and test compounds in the presence of 5uM ATP/ [gamm...
In DepthDetails ArticlePubMed