BDBM15921 2-pyridinecarboxamide deriv. 17a::5-Cyano-6-ethoxy-pyridine-2-carboxylic acid 4-methanesulfonyl-benzylamide::5-cyano-6-ethoxy-N-[(4-methanesulfonylphenyl)methyl]pyridine-2-carboxamide
SMILES CCOc1nc(ccc1C#N)C(=O)NCc1ccc(cc1)S(C)(=O)=O
InChI Key InChIKey=GCJDFBAXDJMMIC-UHFFFAOYSA-N
Data  1 IC50
  Tab Delimited (TSV)   2D SDfile   Computed 3D by Vconf -m prep SDfile
Find this compound or compounds like it in BindingDB:
Activity Spreadsheet -- Enzyme Inhibition Constant Data from BindingDB
Found 1 hit for monomerid = 15921
TargetMitogen-activated protein kinase 8(Homo sapiens (Human))
Abbott Laboratories
LigandPNGBDBM15921(2-pyridinecarboxamide deriv. 17a | 5-Cyano-6-ethox...)
Affinity DataIC50:  390nMpH: 7.2 T: 2°C. Assay description: In vitro substrate phosphorylation using purified recombinant JNK, was incubated with substrate, and test compounds in the presence of 5uM ATP/ [gamm...
In DepthDetails ArticlePubMed