BDBM15922 2-pyridinecarboxamide deriv. 17b::5-cyano-N-[(2,5-dimethoxyphenyl)methyl]-6-ethoxypyridine-2-carboxamide
SMILES CCOc1nc(ccc1C#N)C(=O)NCc1cc(OC)ccc1OC
InChI Key InChIKey=VEGKZYFYGCWXMN-UHFFFAOYSA-N
Data  1 IC50
PDB links: 1 PDB ID matches this monomer.
  Tab Delimited (TSV)   2D SDfile   Computed 3D by Vconf -m prep SDfile
Find this compound or compounds like it in BindingDB:
Activity Spreadsheet -- Enzyme Inhibition Constant Data from BindingDB
Found 1 hit for monomerid = 15922
TargetMitogen-activated protein kinase 8(Homo sapiens (Human))
Abbott Laboratories
LigandPNGBDBM15922(2-pyridinecarboxamide deriv. 17b | 5-cyano-N-[(2,5...)
Affinity DataIC50:  230nMpH: 7.2 T: 2°C. Assay description: In vitro substrate phosphorylation using purified recombinant JNK, was incubated with substrate, and test compounds in the presence of 5uM ATP/ [gamm...