BDBM160214 US9040663, 60
SMILES CC(=O)N[C@@H](CCCNC(N)=N)C(=O)N[C@H]1CCC(=O)NCCC[C@H](NC(=O)[C@H](Cc2c[nH]c3ccccc23)NC(=O)[C@H](CCCNC(N)=N)NC(=O)[C@@H](Cc2ccc(F)cc2)NC(=O)[C@@H]2C[C@@H](O)CN2C1=O)C(N)=O
InChI Key
Data  2 KI
  Tab Delimited (TSV)   2D SDfile   Computed 3D by Vconf -m prep SDfile
Find this compound or compounds like it in BindingDB:
Activity Spreadsheet -- Enzyme Inhibition Constant Data from BindingDB
Found 2 hits for monomerid = 160214
TargetMelanocortin receptor 4(Homo sapiens (Human))
Astrazeneca
US Patent
LigandPNGBDBM160214(US9040663, 60)
Affinity DataKi:  1nM ΔG°:  -12.8kcal/molepH: 7.5 T: 2°C. Assay description: A competitive inhibition binding assay was performed for exemplified peptides according to the invention using membrane homogenates prepared from HEK...
In DepthDetails US Patent
TargetMelanocyte-stimulating hormone receptor(Homo sapiens (Human))
Astrazeneca
US Patent
LigandPNGBDBM160214(US9040663, 60)
Affinity DataKi:  89nM ΔG°:  -10.0kcal/molepH: 7.5 T: 2°C. Assay description: A competitive inhibition binding assay was performed for exemplified peptides according to the invention using membrane homogenates prepared from HEK...
In DepthDetails US Patent