BDBM160711 US9045501, 3
SMILES Cc1cn2CCN([C@@H]3CN4CCC3CC4)C(=O)c3cccc1c23
InChI Key InChIKey=UYSKPMCDNLQXLI-QGZVFWFLSA-N
Data  1 KI
  Tab Delimited (TSV)   2D SDfile   Computed 3D by Vconf -m prep SDfile
Find this compound or compounds like it in BindingDB:
Activity Spreadsheet -- Enzyme Inhibition Constant Data from BindingDB
Found 1 hit for monomerid = 160711
Target5-hydroxytryptamine receptor 3A(Homo sapiens (Human))
Albany Molecular Research
US Patent
LigandPNGBDBM160711(US9045501, 3)
Affinity DataKi:  5nM ΔG°:  -11.3kcal/molepH: 7.5 T: 2°C. Assay description: The relative affinity of the various compounds for the human 5-HT3 receptor was measured in a radioligand binding assay, using a scintillation proxim...
In DepthDetails US Patent