BDBM160718 US9045501, 13
SMILES O=C1N(CCn2cnc3cccc1c23)[C@@H]1CN2CCC1CC2
InChI Key InChIKey=YLPZXKURYOEIQJ-OAHLLOKOSA-N
Data  1 KI
  Tab Delimited (TSV)   2D SDfile   Computed 3D by Vconf -m prep SDfile
Find this compound or compounds like it in BindingDB:
Activity Spreadsheet -- Enzyme Inhibition Constant Data from BindingDB
Found 1 hit for monomerid = 160718
Target5-hydroxytryptamine receptor 3A(Homo sapiens (Human))
Albany Molecular Research
US Patent
LigandPNGBDBM160718(US9045501, 13)
Affinity DataKi:  32nM ΔG°:  -10.2kcal/molepH: 7.5 T: 2°C. Assay description: The relative affinity of the various compounds for the human 5-HT3 receptor was measured in a radioligand binding assay, using a scintillation proxim...
In DepthDetails US Patent