BDBM160722 US9045501, 17
SMILES CCc1nc2cccc3C(=O)N(CCn1c23)[C@@H]1CN2CCC1CC2
InChI Key InChIKey=LGLCKEXISVFUDS-MRXNPFEDSA-N
Data  1 KI
  Tab Delimited (TSV)   2D SDfile   Computed 3D by Vconf -m prep SDfile
Find this compound or compounds like it in BindingDB:
Activity Spreadsheet -- Enzyme Inhibition Constant Data from BindingDB
Found 1 hit for monomerid = 160722
Target5-hydroxytryptamine receptor 3A(Homo sapiens (Human))
Albany Molecular Research
US Patent
LigandPNGBDBM160722(US9045501, 17)
Affinity DataKi:  130nM ΔG°:  -9.39kcal/molepH: 7.5 T: 2°C. Assay description: The relative affinity of the various compounds for the human 5-HT3 receptor was measured in a radioligand binding assay, using a scintillation proxim...
In DepthDetails US Patent