BDBM160905 US10093655, Example 75::US11014909, Example 75::US9107923, 75
SMILES Cc1cc(Oc2ncccc2OC(F)F)ccc1-c1c(C)ncc(=O)n1C
InChI Key InChIKey=IVYPKTLOXADZFD-UHFFFAOYSA-N
Data  3 KI
  Tab Delimited (TSV)   2D SDfile   Computed 3D by Vconf -m prep SDfile
Find this compound or compounds like it in BindingDB:
Activity Spreadsheet -- Enzyme Inhibition Constant Data from BindingDB
Found 3 hits for monomerid = 160905
TargetD(1A) dopamine receptor(Homo sapiens (Human))
Pfizer
US Patent
LigandPNGBDBM160905(US10093655, Example 75 | US11014909, Example 75 | ...)
Affinity DataKi:  87nM. Assay description: The affinity of the compounds described herein was determined by competition binding assays similar to those described in Ryman-Rasmussen et al., Dif...
Ligand InfoPC cidPC sid
In DepthDetails US Patent
TargetD(1A) dopamine receptor(Homo sapiens (Human))
Pfizer
US Patent
LigandPNGBDBM160905(US10093655, Example 75 | US11014909, Example 75 | ...)
Affinity DataKi:  87nM. Assay description: D1 binding assays were performed using over-expressing LTK human cell lines. To determine basic assay parameters, ligand concentrations were determin...
Ligand InfoPC cidPC sid
In DepthDetails US Patent
TargetD(1A) dopamine receptor(Homo sapiens (Human))
Pfizer
US Patent
LigandPNGBDBM160905(US10093655, Example 75 | US11014909, Example 75 | ...)
Affinity DataKi:  87nMpH: 7.4Assay Description:The affinity of the compounds described herein was determined by competition binding assays similar to those described in Ryman-Rasmussen et al., "Di...
Ligand InfoPC cidPC sid
In DepthDetails US Patent