BDBM16266 amide-urethane derived inhibitor 12b::but-3-en-1-yl N-[(1S)-1-{[(1S)-1-{[(1R,3S,4S)-1-{[(1S)-1-(benzylcarbamoyl)-2-methylpropyl]carbamoyl}-3-hydroxy-1,6-dimethylheptan-4-yl]carbamoyl}-2-(prop-2-en-1-ylcarbamoyl)ethyl]carbamoyl}-2-methylpropyl]carbamate
SMILES CC(C)C[C@H](NC(=O)[C@H](CC(=O)NCC=C)NC(=O)[C@@H](NC(=O)OCCC=C)C(C)C)[C@@H](O)C[C@@H](C)C(=O)N[C@@H](C(C)C)C(=O)NCc1ccccc1
InChI Key InChIKey=MUYOMGHAKVGEJJ-HHRGOUEHSA-N
Data  1 KI
  Tab Delimited (TSV)   2D SDfile   Computed 3D by Vconf -m prep SDfile
Find this compound or compounds like it in BindingDB:
Activity Spreadsheet -- Enzyme Inhibition Constant Data from BindingDB
Found 1 hit for monomerid = 16266
TargetBeta-secretase 1(Homo sapiens (Human))
University Of Illinois At Chicago
LigandPNGBDBM16266(amide-urethane derived inhibitor 12b | but-3-en-1-...)
Affinity DataKi:  61.4nM ΔG°:  -10.2kcal/molepH: 4.5 T: 2°C. Assay description: Enzyme activities were assayed by monitoring the hydrolysis of substrate in the presence or absence of inhibitor compounds. The hydrolysis was record...
In DepthDetails ArticlePubMed