BDBM164268 US9669031, 7 3-methyl-6-(pyrimidin-4-ylamino)-3-(2,2,2-trifluoroethyl)-2,3-dihydroimidazo[1,5-a]pyridine-1,5-dione (Cpd. No. 7)
SMILES CC1(CC(F)(F)F)NC(=O)c2ccc(Nc3ccncn3)c(=O)n12
InChI Key InChIKey=XDQARUIZEWXSRW-UHFFFAOYSA-N
Data  2 IC50
  Tab Delimited (TSV)   2D SDfile   Computed 3D by Vconf -m prep SDfile
Find this compound or compounds like it in BindingDB:
Activity Spreadsheet -- Enzyme Inhibition Constant Data from BindingDB
Found 2 hits for monomerid = 164268
TargetMAP kinase-interacting serine/threonine-protein kinase 2(Homo sapiens (Human))
Effector Therapeutics
US Patent
LigandPNGBDBM164268(US9669031, 7 3-methyl-6-(pyrimidin-4-ylamino)-3-(2...)
Affinity DataIC50: <10nMT: 2°C. Assay description: Compounds are screened for Mnk inhibition using the ADP-Glo kinase assay kit (Promega, catalogue No. V9101). All kinase reactions are performed in Re...
Ligand InfoPC cidPC sid
In DepthDetails US Patent
TargetMAP kinase-interacting serine/threonine-protein kinase 1(Homo sapiens (Human))
Effector Therapeutics
US Patent
LigandPNGBDBM164268(US9669031, 7 3-methyl-6-(pyrimidin-4-ylamino)-3-(2...)
Affinity DataIC50:  55nMT: 2°C. Assay description: Compounds are screened for Mnk inhibition using the ADP-Glo kinase assay kit (Promega, catalogue No. V9101). All kinase reactions are performed in Re...
Ligand InfoPC cidPC sid
In DepthDetails US Patent