BDBM164446 US9066954, 141
SMILES COc1ccc2c(OCc3nnc4ccc(nn34)-c3ccc4OCCc4c3)ccnc2c1
InChI Key InChIKey=YZDSGDRDEZVFIN-UHFFFAOYSA-N
Data  1 KI
  Tab Delimited (TSV)   2D SDfile   Computed 3D by Vconf -m prep SDfile
Find this compound or compounds like it in BindingDB:
Activity Spreadsheet -- Enzyme Inhibition Constant Data from BindingDB
Found 1 hit for monomerid = 164446
TargetHepatocyte growth factor receptor(Homo sapiens (Human))
Amgen
US Patent
LigandPNGBDBM164446(US9066954, 141)
Affinity DataKi:  2.90nM ΔG°:  -11.7kcal/molepH: 8.0 T: 2°C. Assay description: A PCR product covering residues 1058-1365 of c-Met (c-Met kinase domain) is generated from Human Liver QuickClone cDNA (Invitrogen) using forward pri...
Ligand InfoPC cidPC sid
In DepthDetails US Patent