BDBM16487 2-[6-(morpholin-4-yl)-3-[(4,5,7-trifluoro-1,3-benzothiazol-2-yl)methyl]-1H-indol-1-yl]acetic acid::Indoleacetic Acid Inhibitor 43
SMILES OC(=O)Cn1cc(Cc2nc3c(F)c(F)cc(F)c3s2)c2ccc(cc12)N1CCOCC1
InChI Key InChIKey=ZFHMZAGFUQFFEJ-UHFFFAOYSA-N
Data  2 IC50
  Tab Delimited (TSV)   2D SDfile   Computed 3D by Vconf -m prep SDfile
Find this compound or compounds like it in BindingDB:
Activity Spreadsheet -- Enzyme Inhibition Constant Data from BindingDB
Found 2 hits for monomerid = 16487
TargetAldo-keto reductase family 1 member A1(Homo sapiens (Human))
The Institute For Diabetes Discovery
LigandPNGBDBM16487(2-[6-(morpholin-4-yl)-3-[(4,5,7-trifluoro-1,3-benz...)
Affinity DataIC50:  4.40E+4nM. Assay description: The activity of the test enzyme was determined spectrophotometrically by monitoring the change in absorbance at 340 nm, which is due to the disappear...
In DepthDetails ArticlePubMed
TargetAldo-keto reductase family 1 member B1(Homo sapiens (Human))
The Institute For Diabetes Discovery
LigandPNGBDBM16487(2-[6-(morpholin-4-yl)-3-[(4,5,7-trifluoro-1,3-benz...)
Affinity DataIC50:  15nM. Assay description: The activity of the test enzyme was determined spectrophotometrically by monitoring the change in absorbance at 340 nm, which is due to the disappear...
In DepthDetails ArticlePubMed