BDBM16756 3-[(2R,4S,5S)-6-(3,5-difluorophenyl)-5-{[3-(dipropylcarbamoyl)phenyl]formamido}-2-ethyl-4-hydroxyhexanamido]propanoic acid::CHEMBL295996::Hydroxyethylene-Based Peptidomimetic Inhibitor, 6
SMILES CCCN(CCC)C(=O)c1cccc(c1)C(=O)N[C@@H](Cc1cc(F)cc(F)c1)[C@@H](O)C[C@@H](CC)C(=O)NCCC(O)=O
InChI Key InChIKey=IQPUAQWXFYEAKS-AIGMYPEUSA-N
Data  2 IC50
  Tab Delimited (TSV)   2D SDfile   Computed 3D by Vconf -m prep SDfile
Find this compound or compounds like it in BindingDB:
Activity Spreadsheet -- Enzyme Inhibition Constant Data from BindingDB
Found 2 hits for monomerid = 16756
TargetBeta-secretase 1(Homo sapiens (Human))
Johnson & Johnson Pharmaceutical Research And Development
Curated by ChEMBL
LigandPNGBDBM16756(3-[(2R,4S,5S)-6-(3,5-difluorophenyl)-5-{[3-(diprop...)
Affinity DataIC50:  2.80E+3nM. Assay description: Binding affinity against Beta-secretase
In DepthDetails ArticlePubMed
TargetBeta-secretase 1(Homo sapiens (Human))
Johnson & Johnson Pharmaceutical Research And Development
Curated by ChEMBL
LigandPNGBDBM16756(3-[(2R,4S,5S)-6-(3,5-difluorophenyl)-5-{[3-(diprop...)
Affinity DataIC50:  2.80E+3nMpH: 4.8 T: 2°C. Assay description: Beta-cleavage ELISA assays were carried out in reaction buffer containing enzyme, substrate MBP-C125, and test compounds. Generated beta-cleaved prod...
In DepthDetails ArticlePubMed