BDBM1677 (4S,5R,6R,7S)-1,3,4,7-tetrabenzyl-5,6-dihydroxy-1,3-diazepan-2-one::Cyclic Urea diastereomer 2
SMILES O[C@H]1[C@H](O)[C@H](Cc2ccccc2)N(Cc2ccccc2)C(=O)N(Cc2ccccc2)[C@H]1Cc1ccccc1
InChI Key InChIKey=HZUCRWWOEVMAPC-GASGPIRDSA-N
Data  1 KI
  Tab Delimited (TSV)   2D SDfile   Computed 3D by Vconf -m prep SDfile
Find this compound or compounds like it in BindingDB:
Activity Spreadsheet -- Enzyme Inhibition Constant Data from BindingDB
Found 1 hit for monomerid = 1677
TargetDimer of Gag-Pol polyprotein [489-587](Human immunodeficiency virus type 1)
Dupont Pharmaceuticals
LigandPNGBDBM1677((4S,5R,6R,7S)-1,3,4,7-tetrabenzyl-5,6-dihydroxy-1,...)
Affinity DataKi:  3.81E+3nM ΔG°:  -7.68kcal/molepH: 5.5 T: 2°C. Assay description: Inhibition of HIV protease was measured by assay of the cleavage of a fluorescent peptide substrate. The fluorescent product (2-aminobenzoyl-Ala-Thr-...
In DepthDetails ArticlePubMed