BDBM16924 5-{5-[(2S)-2-amino-3-(1H-indol-3-yl)propoxy]pyridin-3-yl}-1H,2H,3H-pyrrolo[2,3-b]pyridin-2-one::pyrrolo[2,3-b]pyridin-2-one, 9f
SMILES N[C@H](COc1cncc(c1)-c1cnc2NC(=O)Cc2c1)Cc1c[nH]c2ccccc12
InChI Key InChIKey=NDICSBBPLKHPTN-SFHVURJKSA-N
Data  2 IC50
  Tab Delimited (TSV)   2D SDfile   Computed 3D by Vconf -m prep SDfile
Find this compound or compounds like it in BindingDB:
Activity Spreadsheet -- Enzyme Inhibition Constant Data from BindingDB
Found 2 hits for monomerid = 16924
TargetRAC-alpha serine/threonine-protein kinase(Homo sapiens (Human))
Zhejiang University
Curated by ChEMBL
LigandPNGBDBM16924(5-{5-[(2S)-2-amino-3-(1H-indol-3-yl)propoxy]pyridi...)
Affinity DataIC50:  7.40nM. Assay description: Inhibition of Akt
In DepthDetails ArticlePubMed
LigandPNGBDBM16924(5-{5-[(2S)-2-amino-3-(1H-indol-3-yl)propoxy]pyridi...)
Affinity DataIC50:  99nMpH: 7.5 T: 2°C. Assay description: The kinase assay uses His-Akt1 and a biotinylated peptide as substrate. The biotinylated peptides were immobilized on streptavidin-coated FLASH plat...
In DepthDetails ArticlePubMed