BDBM16935 5-{5-[(2S)-2-amino-3-(1H-indol-3-yl)propoxy]pyridin-3-yl}-3-ethyl-2,3-dihydro-1H-indol-2-one::oxindole pyridine, 9q
SMILES CCC1C(=O)Nc2ccc(cc12)-c1cncc(OC[C@@H](N)Cc2c[nH]c3ccccc23)c1
InChI Key InChIKey=UZRBYHFZHKYQJZ-ZQRQZVKFSA-N
Data  2 IC50
  Tab Delimited (TSV)   2D SDfile   Computed 3D by Vconf -m prep SDfile
Find this compound or compounds like it in BindingDB:
Activity Spreadsheet -- Enzyme Inhibition Constant Data from BindingDB
Found 2 hits for monomerid = 16935
TargetRAC-alpha serine/threonine-protein kinase(Homo sapiens (Human))
Zhejiang University
Curated by ChEMBL
LigandPNGBDBM16935(5-{5-[(2S)-2-amino-3-(1H-indol-3-yl)propoxy]pyridi...)
Affinity DataIC50:  52.7nM. Assay description: Inhibition of Akt
In DepthDetails ArticlePubMed
LigandPNGBDBM16935(5-{5-[(2S)-2-amino-3-(1H-indol-3-yl)propoxy]pyridi...)
Affinity DataIC50:  80nMpH: 7.5 T: 2°C. Assay description: The kinase assay uses His-Akt1 and a biotinylated peptide as substrate. The biotinylated peptides were immobilized on streptavidin-coated FLASH plat...
In DepthDetails ArticlePubMed