BDBM171379 US9085571, Table 1, Compound 27
SMILES COc1ccc(cc1)S(=O)(=O)N(CC(C)C)C[C@@H](O)[C@H](Cc1ccccc1)NC(=O)c1ccccc1C(=O)N(C)Cc1nc(C)oc1C
InChI Key InChIKey=IMVJGSFWSKAFMF-UZNNEEJFSA-N
Data  1 KI
  Tab Delimited (TSV)   2D SDfile   Computed 3D by Vconf -m prep SDfile
Find this compound or compounds like it in BindingDB:
Activity Spreadsheet -- Enzyme Inhibition Constant Data from BindingDB
Found 1 hit for monomerid = 171379
TargetProtease(Human immunodeficiency virus 1 (HIV-1))
Purdue Research Foundation
US Patent
LigandPNGBDBM171379(US9085571, Table 1, Compound 27)
Affinity DataKi:  600nM. Assay description: Without being bound by theory, it is suggested that the compounds described herein may exert their utility by the inhibition of proteases encoded by ...
In DepthDetails US Patent