BDBM17183 (3S)-3-(4-{[3-(2-methyl-4-{[(2-methylphenyl)carbamoyl]amino}phenyl)-2-oxo-1,2-dihydropyridin-1-yl]methyl}phenyl)butanoic acid::Pyridone derivative, 29
SMILES C[C@@H](CC(O)=O)c1ccc(Cn2cccc(-c3ccc(NC(=O)Nc4ccccc4C)cc3C)c2=O)cc1
InChI Key InChIKey=BTYSVIBSJVRJTA-NRFANRHFSA-N
Data  1 KI
  Tab Delimited (TSV)   2D SDfile   Computed 3D by Vconf -m prep SDfile
Find this compound or compounds like it in BindingDB:
Activity Spreadsheet -- Enzyme Inhibition Constant Data from BindingDB
Found 1 hit for monomerid = 17183
TargetIntegrin alpha-4/beta-1 [T112H](Homo sapiens (Human))
Glaxosmithkline
LigandPNGBDBM17183((3S)-3-(4-{[3-(2-methyl-4-{[(2-methylphenyl)carbam...)
Affinity DataKi:  19.9nM. Assay description: J6 cells (1 million cells/well) were allowed to coat wheat germ agglutinin coated SPA beads (Amersham, 1 mg/well) in assay buffer. Tritiated 3H Stand...
In DepthDetails ArticlePubMed