BDBM173259 US10323032, Example 11::US9096596, 11::US9604982, Example 11
SMILES Clc1cccc(C(=O)N2CCc3c(C2)ncnc3-c2ccccn2)c1Cl
InChI Key InChIKey=OAMJRWUIWCSIBZ-UHFFFAOYSA-N
Data  8 KI  8 IC50
  Tab Delimited (TSV)   2D SDfile   Computed 3D by Vconf -m prep SDfile
Find this compound or compounds like it in BindingDB:
Activity Spreadsheet -- Enzyme Inhibition Constant Data from BindingDB
Found 16 hits for monomerid = 173259
TargetP2X purinoceptor 7(Homo sapiens (Human))
Janssen Pharmaceutica
US Patent
LigandPNGBDBM173259(US10323032, Example 11 | US9096596, 11 | US9604982...)
Affinity DataKi:  37.2nM. Assay description: human or rat P2X7-1321N1 cells were collected and frozen @ −80° C. On the day of the experiment, cell membrane preparations were made according...
In DepthDetails US Patent
TargetP2X purinoceptor 7(Homo sapiens (Human))
Janssen Pharmaceutica
US Patent
LigandPNGBDBM173259(US10323032, Example 11 | US9096596, 11 | US9604982...)
Affinity DataKi:  37.2nM. Assay description: Human or rat P2X7-1321 N1 cells were collected and frozen @−80° C. On the day of the experiment, cell membrane preparations were made according...
In DepthDetails US Patent
TargetP2X purinoceptor 7(Homo sapiens (Human))
Janssen Pharmaceutica
US Patent
LigandPNGBDBM173259(US10323032, Example 11 | US9096596, 11 | US9604982...)
Affinity DataKi:  37.2nM. Assay description: Human or rat P2X7-1321N1 cells were collected and frozen @ −80° C. On the day of the experiment, cell membrane preparations were made according...
In DepthDetails US Patent
TargetP2X purinoceptor 7(Homo sapiens (Human))
Janssen Pharmaceutica
US Patent
LigandPNGBDBM173259(US10323032, Example 11 | US9096596, 11 | US9604982...)
Affinity DataKi:  37.2nM. Assay description: Human or rat P2X7-1321N1 cells were collected and frozen @ −80° C. On the day of the experiment, cell membrane preparations were made according...
In DepthDetails US Patent
TargetP2X purinoceptor 7(Rattus norvegicus (Rat))
Janssen Pharmaceutica
US Patent
LigandPNGBDBM173259(US10323032, Example 11 | US9096596, 11 | US9604982...)
Affinity DataKi:  61.7nM. Assay description: Human or rat P2X7-1321 N1 cells were collected and frozen @−80° C. On the day of the experiment, cell membrane preparations were made according...
In DepthDetails US Patent
TargetP2X purinoceptor 7(Rattus norvegicus (Rat))
Janssen Pharmaceutica
US Patent
LigandPNGBDBM173259(US10323032, Example 11 | US9096596, 11 | US9604982...)
Affinity DataKi:  61.7nM. Assay description: 1321N1 cells expressing the recombinant human or rat P2X7 channel was cultured in HyQ DME/(HyClone/Dulbecco's Modified Eagle Medium) high glucose...
In DepthDetails US Patent
TargetP2X purinoceptor 7(Rattus norvegicus (Rat))
Janssen Pharmaceutica
US Patent
LigandPNGBDBM173259(US10323032, Example 11 | US9096596, 11 | US9604982...)
Affinity DataKi:  61.7nM. Assay description: 1321N1 cells expressing the recombinant human or rat P2X7 channel was cultured in HyQ DME/(HyClone/Dulbecco's Modified Eagle Medium) high glucose...
In DepthDetails US Patent
TargetP2X purinoceptor 7(Rattus norvegicus (Rat))
Janssen Pharmaceutica
US Patent
LigandPNGBDBM173259(US10323032, Example 11 | US9096596, 11 | US9604982...)
Affinity DataKi:  61.7nM. Assay description: human or rat P2X7-1321N1 cells were collected and frozen @ −80° C. On the day of the experiment, cell membrane preparations were made according...
In DepthDetails US Patent
TargetP2X purinoceptor 7(Homo sapiens (Human))
Janssen Pharmaceutica
US Patent
LigandPNGBDBM173259(US10323032, Example 11 | US9096596, 11 | US9604982...)
Affinity DataIC50:  416nM. Assay description: 1321N1 cells expressing the recombinant human or rat P2X7 channel was cultured in HyQ DME/(HyClone/Dulbecco's Modified Eagle Medium) high glucose...
In DepthDetails US Patent
TargetP2X purinoceptor 7(Rattus norvegicus (Rat))
Janssen Pharmaceutica
US Patent
LigandPNGBDBM173259(US10323032, Example 11 | US9096596, 11 | US9604982...)
Affinity DataIC50: >1.00E+4nM. Assay description: Human or rat P2X7-1321N1 cells were collected and frozen @ −80° C. On the day of the experiment, cell membrane preparations were made according...
In DepthDetails US Patent
TargetP2X purinoceptor 7(Homo sapiens (Human))
Janssen Pharmaceutica
US Patent
LigandPNGBDBM173259(US10323032, Example 11 | US9096596, 11 | US9604982...)
Affinity DataIC50:  416nM. Assay description: 1321N1 cells expressing the recombinant human or rat P2X7 channel was cultured in HyQ DME/(HyClone/Dulbecco's Modified Eagle Medium) high glucose...
In DepthDetails US Patent
TargetP2X purinoceptor 7(Rattus norvegicus (Rat))
Janssen Pharmaceutica
US Patent
LigandPNGBDBM173259(US10323032, Example 11 | US9096596, 11 | US9604982...)
Affinity DataIC50: >1.00E+4nM. Assay description: 1321N1 cells expressing the recombinant human or rat P2X7 channel was cultured in HyQ DME/(HyClone/Dulbecco's Modified Eagle Medium) high glucose...
In DepthDetails US Patent
TargetP2X purinoceptor 7(Homo sapiens (Human))
Janssen Pharmaceutica
US Patent
LigandPNGBDBM173259(US10323032, Example 11 | US9096596, 11 | US9604982...)
Affinity DataIC50:  416nM. Assay description: 1321N1 cells expressing the recombinant human or rat P2X7 channel was cultured in HyQ DME/(HyClone/Dulbecco's Modified Eagle Medium) high glucose...
In DepthDetails US Patent
TargetP2X purinoceptor 7(Rattus norvegicus (Rat))
Janssen Pharmaceutica
US Patent
LigandPNGBDBM173259(US10323032, Example 11 | US9096596, 11 | US9604982...)
Affinity DataIC50: >1.00E+4nMpH: 7.4Assay Description:1321N1 cells expressing the recombinant human, rat or mouse P2X7 channel was cultured in HyQ DME/(HyClone/Dulbecco's Modified Eagle Medium) high gluc...
In DepthDetails US Patent
TargetP2X purinoceptor 7(Homo sapiens (Human))
Janssen Pharmaceutica
US Patent
LigandPNGBDBM173259(US10323032, Example 11 | US9096596, 11 | US9604982...)
Affinity DataIC50:  416nMpH: 7.4Assay Description:1321N1 cells expressing the recombinant human, rat or mouse P2X7 channel was cultured in HyQ DME/(HyClone/Dulbecco's Modified Eagle Medium) high gluc...
In DepthDetails US Patent
TargetP2X purinoceptor 7(Rattus norvegicus (Rat))
Janssen Pharmaceutica
US Patent
LigandPNGBDBM173259(US10323032, Example 11 | US9096596, 11 | US9604982...)
Affinity DataIC50: >1.00E+4nM. Assay description: Human or rat P2X7-1321N1 cells were collected and frozen @ −80° C. On the day of the experiment, cell membrane preparations were made according...
In DepthDetails US Patent