BDBM175065 US9688678, 26 (+-)-3-(2-methoxyphenyl)-1-[(5-methoxy-2-pyridyl)sulfonyl]-3-[2-(4-methylpiperazin-1-yl)-6-azaspiro[3.3]heptan-6-yl]-2-oxo-indoline-5-carbonitrile
SMILES COc1ccc(nc1)S(=O)(=O)N1C2C=CC(=CC2C(N2CC3(CN(C3)N3CCN(C)CC3)C2)(C1=O)c1ccccc1OC)C#N
InChI Key InChIKey=PFYJSXOIEFLDNQ-UHFFFAOYSA-N
Data  1 KI
  Tab Delimited (TSV)   2D SDfile   Computed 3D by Vconf -m prep SDfile
Find this compound or compounds like it in BindingDB:
Activity Spreadsheet -- Enzyme Inhibition Constant Data from BindingDB
Found 1 hit for monomerid = 175065
TargetVasopressin V1b receptor(Homo sapiens (Human))
Abbvie Deutschland
US Patent
LigandPNGBDBM175065(US9688678, 26 (+-)-3-(2-methoxyphenyl)-1-[(5-metho...)
Affinity DataKi:  5.5nM ΔG°:  -11.3kcal/molepH: 7.4 T: 2°C. Assay description: The binding assay was carried out by the method based on that of Tahara et al. (Tahara A et al., Brit. J. Pharmacol. 125, 1463-1470 (1998)). The incu...
Ligand InfoPC cidPC sid
In DepthDetails US Patent