BDBM176794 US9675612, 32 6-{[2-(Piperidin-1-ylcarbonyl)[1,3]thiazolo[5,4-d]pyrimidin-7-yl]amino}-1,3-benzothiazol-2(3H)-one
SMILES O=C(N1CCCCC1)c1nc2c(Nc3ccc4[nH]c(=O)sc4c3)ncnc2s1
InChI Key InChIKey=FSGSASMAGXXRPZ-UHFFFAOYSA-N
Data  1 IC50
  Tab Delimited (TSV)   2D SDfile   Computed 3D by Vconf -m prep SDfile
Find this compound or compounds like it in BindingDB:
Activity Spreadsheet -- Enzyme Inhibition Constant Data from BindingDB
Found 1 hit for monomerid = 176794
TargetIsoform 2 of MAP kinase-interacting serine/threonine-protein kinase 1 (MNK1a) 344D](Homo sapiens (Human))
Bayer Pharma Aktiengesellschaft
US Patent
LigandPNGBDBM176794(US9675612, 32 6-{[2-(Piperidin-1-ylcarbonyl)[1,3]t...)
Affinity DataIC50:  137nMpH: 7.5Assay Description:For the assay 50 nL of a 100 fold concentrated solution of the test compound in DMSO was pipetted into a black low volume 384 well microtiter plate (...
Ligand InfoPC cidPC sid
In DepthDetails US Patent