BDBM176807 US9675612, 44 N,N-Dimethyl-7-{[6-(propan-2-yloxy)-1H-indazol-5-yl]amino}[1,3]thiazolo[5,4-d]pyrimidine-2-carboxamide
SMILES CC(C)Oc1cc2[nH]ncc2cc1Nc1ncnc2sc(nc12)C(=O)N(C)C
InChI Key InChIKey=GZOIWXBZLNFSOM-UHFFFAOYSA-N
Data  1 IC50
  Tab Delimited (TSV)   2D SDfile   Computed 3D by Vconf -m prep SDfile
Find this compound or compounds like it in BindingDB:
Activity Spreadsheet -- Enzyme Inhibition Constant Data from BindingDB
Found 1 hit for monomerid = 176807
TargetIsoform 2 of MAP kinase-interacting serine/threonine-protein kinase 1 (MNK1a) 344D](Homo sapiens (Human))
Bayer Pharma Aktiengesellschaft
US Patent
LigandPNGBDBM176807(US9675612, 44 N,N-Dimethyl-7-{[6-(propan-2-yloxy)-...)
Affinity DataIC50:  52nMpH: 7.5Assay Description:For the assay 50 nL of a 100 fold concentrated solution of the test compound in DMSO was pipetted into a black low volume 384 well microtiter plate (...
Ligand InfoPC cidPC sid
In DepthDetails US Patent