BDBM17709 2-aminobenzoxazole, 34::N-(4-chloro-3-{[(2S)-1-methylpyrrolidin-2-yl]methoxy}phenyl)-5-{1H-pyrrolo[2,3-b]pyridin-4-yloxy}-1,3-benzoxazol-2-amine
SMILES CN1CCC[C@H]1COc1cc(Nc2nc3cc(Oc4ccnc5[nH]ccc45)ccc3o2)ccc1Cl
InChI Key InChIKey=BIJITFOSDDPLRR-KRWDZBQOSA-N
Data  1 KI
  Tab Delimited (TSV)   2D SDfile   Computed 3D by Vconf -m prep SDfile
Find this compound or compounds like it in BindingDB:
Activity Spreadsheet -- Enzyme Inhibition Constant Data from BindingDB
Found 1 hit for monomerid = 17709
TargetVascular endothelial growth factor receptor 2(Homo sapiens (Human))
Amgen
LigandPNGBDBM17709(2-aminobenzoxazole, 34 | N-(4-chloro-3-{[(2S)-1-me...)
Affinity DataKi:  1.60nM. Assay description: The assay involves the phosphorylation of a biotinylated substrate and the detection of this phosphorylation after the addition of a streptavidin-all...
In DepthDetails ArticlePubMed