BDBM18027 2-(7-{[(2R)-1-(4-{3-[(2-methoxyphenyl)methoxy]propoxy}phenyl)-6-oxopiperazin-2-yl]methoxy}-1,2,3,4-tetrahydroquinolin-1-yl)ethyl 2-methylpropanoate::Ketopiperazine-based inhibitor, 7
SMILES COc1ccccc1COCCCOc1ccc(cc1)N1[C@@H](COc2ccc3CCCN(CCOC(=O)C(C)C)c3c2)CNCC1=O
InChI Key InChIKey=APVPAEUTGJXHOF-WJOKGBTCSA-N
Data  1 IC50
  Tab Delimited (TSV)   2D SDfile   Computed 3D by Vconf -m prep SDfile
Find this compound or compounds like it in BindingDB:
Activity Spreadsheet -- Enzyme Inhibition Constant Data from BindingDB
Found 1 hit for monomerid = 18027
TargetRenin(Homo sapiens (Human))
Pfizer
LigandPNGBDBM18027(2-(7-{[(2R)-1-(4-{3-[(2-methoxyphenyl)methoxy]prop...)
Affinity DataIC50:  550nMpH: 7.4 T: 2°C. Assay description: The renin assay utilized a tandem Green Flourescent Protein (tGFP) substrate that was hydrolyzed by human rennin. The tGFP substrate contained a nine...
In DepthDetails ArticlePubMed