BDBM18131 SB-243545::butyl (2S)-2-[(2S)-2-amino-3-(4-hydroxyphenyl)propanamido]-2-[(2S,3S,4S,5S)-1,3,4,5-tetrahydroxy-4-(hydroxymethyl)piperidin-2-yl]acetate
SMILES [H][C@]1([C@H](NC(=O)[C@@H](N)Cc2ccc(O)cc2)C(=O)OCCCC)[C@H](O)[C@](O)(CO)[C@@H](O)CN1O
InChI Key InChIKey=IPZUTNGJHRAITA-FULAYSDLSA-N
Data  1 IC50
PDB links: 1 PDB ID matches this monomer.
  Tab Delimited (TSV)   2D SDfile   Computed 3D by Vconf -m prep SDfile
Find this compound or compounds like it in BindingDB:
Activity Spreadsheet -- Enzyme Inhibition Constant Data from BindingDB
Found 1 hit for monomerid = 18131
TargetTyrosine--tRNA ligase(Staphylococcus aureus)
Gsk
LigandPNGBDBM18131(SB-243545 | butyl (2S)-2-[(2S)-2-amino-3-(4-hydrox...)
Affinity DataIC50:  0.200nMpH: 7.9 T: 2°C. Assay description: The concentration of inhibitor which results in 50% inhibition (IC50) of enzyme activity was determined by preincubating recombinant S. aureus TyrRS ...