BDBM181390 US9139577, 1.021::US9708274, 1.021
SMILES FCC(CF)Oc1cc(F)ccc1Nc1ncnc2cc(cc(c12)C(F)(F)F)N=S1(=O)CCOCC1
InChI Key InChIKey=LNKJZWXIHBRRPK-UHFFFAOYSA-N
Data  2 IC50
  Tab Delimited (TSV)   2D SDfile   Computed 3D by Vconf -m prep SDfile
Find this compound or compounds like it in BindingDB:
Activity Spreadsheet -- Enzyme Inhibition Constant Data from BindingDB
Found 2 hits for monomerid = 181390
TargetMAP kinase-interacting serine/threonine-protein kinase 2(Homo sapiens (Human))
Evotec International
US Patent
LigandPNGBDBM181390(US9139577, 1.021 | US9708274, 1.021)
Affinity DataIC50:  1nMT: 2°C. Assay description: The inhibition of kinase activity of MNK2a was assessed using pre-activated GST-MNK2a. The white, 384-well OptiPlate F plates were purchased from Per...
In DepthDetails US Patent
TargetMAP kinase-interacting serine/threonine-protein kinase 2(Homo sapiens (Human))
Evotec International
US Patent
LigandPNGBDBM181390(US9139577, 1.021 | US9708274, 1.021)
Affinity DataIC50:  1nM. Assay description: The inhibition of kinase activity of MNK2a was assessed using pre-activated GST-MNK2a. The white, 384-well OptiPlate F plates were purchased from Per...
In DepthDetails US Patent