BDBM182723 US9145402, 30
SMILES CNc1nc(Nc2cc(F)c(cc2OC)N2CCCC2=O)ncc1C(F)(F)F
InChI Key InChIKey=MMSUYYTWZDZASK-UHFFFAOYSA-N
Data  1 KI
  Tab Delimited (TSV)   2D SDfile   Computed 3D by Vconf -m prep SDfile
Find this compound or compounds like it in BindingDB:
Activity Spreadsheet -- Enzyme Inhibition Constant Data from BindingDB
Found 1 hit for monomerid = 182723
TargetLeucine-rich repeat serine/threonine-protein kinase 2(Homo sapiens (Human))
Genentech
US Patent
LigandPNGBDBM182723(US9145402, 30)
Affinity DataKi:  3nM. Assay description: his assay was used to determine a compound's potency in inhibiting activity of LRRK2 by determining, Kiapp, IC50, or percent inhibition values. In 38...
In DepthDetails US Patent