BDBM185 (4R,5S,6S,7R)-4,7-dibenzyl-5,6-dihydroxy-1,3-bis({[3-(1H-imidazol-4-yl)phenyl]methyl})-1,3-diazepan-2-one::CHEMBL291621::Cyclic Urea
SMILES O[C@@H]1[C@@H](O)[C@@H](Cc2ccccc2)N(Cc2cccc(c2)-c2c[nH]cn2)C(=O)N(Cc2cccc(c2)-c2c[nH]cn2)[C@@H]1Cc1ccccc1
InChI Key InChIKey=LGCLJPYTRGJXHK-RNATXAOGSA-N
Data  2 KI
  Tab Delimited (TSV)   2D SDfile   Computed 3D by Vconf -m prep SDfile
Find this compound or compounds like it in BindingDB:
Activity Spreadsheet -- Enzyme Inhibition Constant Data from BindingDB
Found 2 hits for monomerid = 185
TargetGag-Pol polyprotein [489-587](Human immunodeficiency virus type 1)
Dupont Pharmaceuticals
Curated by ChEMBL
LigandPNGBDBM185((4R,5S,6S,7R)-4,7-dibenzyl-5,6-dihydroxy-1,3-bis({...)
Affinity DataKi:  0.190nM. Assay description: Inhibition of HIV protease, measured by assaying the cleavage of a fluorescent peptide substrate using HPLC
In DepthDetails ArticlePubMed
TargetDimer of Gag-Pol polyprotein [501-599](Human immunodeficiency virus type 1)
Dupont Pharmaceuticals
LigandPNGBDBM185((4R,5S,6S,7R)-4,7-dibenzyl-5,6-dihydroxy-1,3-bis({...)
Affinity DataKi:  0.190nM ΔG°:  -13.8kcal/molepH: 5.5 T: 2°C. Assay description: Ki values were determined with recombinant single-chain dimeric HIV protease and a fluorescent substrate. The use of single-chain dimeric protease a...
In DepthDetails ArticlePubMed