BDBM185001 US9156811, DDD90154
SMILES CCN(c1c(C)nn(C)c1C)[S+]([O-])(=O)c1c(Cl)cc(CCCN2CCN(C)CC2)cc1Cl
InChI Key InChIKey=QCMWJZZSCGOICB-UHFFFAOYSA-N
Data  2 IC50
  Tab Delimited (TSV)   2D SDfile   Computed 3D by Vconf -m prep SDfile
Find this compound or compounds like it in BindingDB:
Activity Spreadsheet -- Enzyme Inhibition Constant Data from BindingDB
Found 2 hits for monomerid = 185001
TargetGlycylpeptide N-tetradecanoyltransferase 1(Homo sapiens (Human))
Univeristy Of Dundee
US Patent
LigandPNGBDBM185001(US9156811, DDD90154)
Affinity DataIC50:  352nMpH: 7.4 T: 2°C. Assay description: Measurement of the ability of compounds to inhibit the NMT-1 and/or NMT-2 enzyme isoforms of human, trypanosome (T. brucei), leishmanial (L. major) a...
In DepthDetails US Patent
TargetGlycylpeptide N-tetradecanoyltransferase(Trypanosoma brucei)
Univeristy Of Dundee
US Patent
LigandPNGBDBM185001(US9156811, DDD90154)
Affinity DataIC50:  3nMpH: 7.4 T: 2°C. Assay description: Measurement of the ability of compounds to inhibit the NMT-1 and/or NMT-2 enzyme isoforms of human, trypanosome (T. brucei), leishmanial (L. major) a...
In DepthDetails US Patent