BDBM185153 CC41801 (1)
SMILES OC(=O)c1ccccc1-c1cccnc1
InChI Key InChIKey=DRGNPLUCFXKUAL-UHFFFAOYSA-N
Data  1 Kd
PDB links: 1 PDB ID matches this monomer.
  Tab Delimited (TSV)   2D SDfile   Computed 3D by Vconf -m prep SDfile
Find this compound or compounds like it in BindingDB:
Activity Spreadsheet -- Enzyme Inhibition Constant Data from BindingDB
Found 1 hit for monomerid = 185153
TargetQuinolone signal response protein(Pseudomonas aeruginosa PAO1)
Helmholtz-Institute For Pharmaceutical Research Saarland
LigandPNGBDBM185153(CC41801 (1))
Affinity DataKd:  900nMT: 2°C. Assay description: ITC titrations were performed using an ITC200 instrument (Microcal Inc.,Malvern). DMSO stock solutions (20 mM) of fragments were diluted 1:20 (v/v) i...