BDBM185818 US9163003, 30
SMILES COc1ccc(cc1)C(=O)C1CCN(CC1)[C@H]1CCN(Cc2nc3ccccc(=O)c3[nH]2)C1=O
InChI Key
Data  2 IC50
  Tab Delimited (TSV)   2D SDfile   Computed 3D by Vconf -m prep SDfile
Find this compound or compounds like it in BindingDB:
Activity Spreadsheet -- Enzyme Inhibition Constant Data from BindingDB
Found 2 hits for monomerid = 185818
TargetPoly [ADP-ribose] polymerase tankyrase-1(Homo sapiens (Human))
Novartis
US Patent
LigandPNGBDBM185818(US9163003, 30)
Affinity DataIC50:  9.5nMT: 2°C. Assay description: The human tankyrase 1 PARP catalytic domain, TNKS1P, was cloned into a pDONR221 vector using the Invitrogen Gateway Technology. This entry clone was ...
In DepthDetails US Patent
TargetPoly [ADP-ribose] polymerase tankyrase-2(Homo sapiens (Human))
Novartis
US Patent
LigandPNGBDBM185818(US9163003, 30)
Affinity DataIC50:  5nMT: 2°C. Assay description: The human tankyrase 1 PARP catalytic domain, TNKS1P, was cloned into a pDONR221 vector using the Invitrogen Gateway Technology. This entry clone was ...
In DepthDetails US Patent