BDBM18666 (2S)-3-(4-acetylphenoxy)-2-hydroxy-2-methyl-N-[4-nitro-3-(trifluoromethyl)phenyl]propanamide::Nonsteroidal AR Ligand, S-7
SMILES CC(=O)c1ccc(OC[C@](C)(O)C(=O)Nc2ccc(c(c2)C(F)(F)F)[N+]([O-])=O)cc1
InChI Key InChIKey=MTQMKPLSGRIFHX-SFHVURJKSA-N
Data  1 KI
  Tab Delimited (TSV)   2D SDfile   Computed 3D by Vconf -m prep SDfile
Find this compound or compounds like it in BindingDB:
Activity Spreadsheet -- Enzyme Inhibition Constant Data from BindingDB
Found 1 hit for monomerid = 18666
TargetAndrogen receptor(Rattus norvegicus (Rat))
University Of Tennessee At Memphis
LigandPNGBDBM18666((2S)-3-(4-acetylphenoxy)-2-hydroxy-2-methyl-N-[4-n...)
Affinity DataKi:  36.6nM ΔG°:  -9.42kcal/molepH: 7.4 T: 2°C. Assay description: The Ki values were determined by the application of the Cheng-Prusoff equation: Ki = (IC50 x Kd)/(Kd+[L]) where [L] is the concentration of [3H]MIB (...
In DepthDetails ArticlePubMed