BDBM186741 US9169205, 2.33
SMILES CC(O)C(=O)N[C@@H](C)c1ccc(O[C@@H]2CCN(C2)c2ccc(OCC3CC3)cc2)cc1
InChI Key InChIKey=BTCBAKVOIHWTHO-RDIXDNMASA-N
Data  1 IC50
  Tab Delimited (TSV)   2D SDfile   Computed 3D by Vconf -m prep SDfile
Find this compound or compounds like it in BindingDB:
Activity Spreadsheet -- Enzyme Inhibition Constant Data from BindingDB
Found 1 hit for monomerid = 186741
TargetAcetyl-CoA carboxylase 2(Homo sapiens (Human))
Boehringer Ingelheim International
US Patent
LigandPNGBDBM186741(US9169205, 2.33)
Affinity DataIC50:  793nMpH: 7.5Assay Description:Assay reactions are then carried out in 384-well plates, with hACC2 in an appropriate dilution and at final assay concentrations (f.c.) of 100 mM Tri...
In DepthDetails US Patent