BDBM18688 (2R)-3-{[3-(2-bromoacetamido)phenyl]sulfanyl}-N-[4-cyano-3-(trifluoromethyl)phenyl]-2-hydroxy-2-methylpropanamide::Bicalutamide Analogue, (R)-14
SMILES C[C@](O)(CSc1cccc(NC(=O)CBr)c1)C(=O)Nc1ccc(C#N)c(c1)C(F)(F)F
InChI Key InChIKey=UTIGFTFHLYIAAT-IBGZPJMESA-N
Data  1 KI
  Tab Delimited (TSV)   2D SDfile   Computed 3D by Vconf -m prep SDfile
Find this compound or compounds like it in BindingDB:
Activity Spreadsheet -- Enzyme Inhibition Constant Data from BindingDB
Found 1 hit for monomerid = 18688
TargetAndrogen receptor(Rattus norvegicus (Rat))
University Of Tennessee At Memphis
LigandPNGBDBM18688((2R)-3-{[3-(2-bromoacetamido)phenyl]sulfanyl}-N-[4...)
Affinity DataKi: >1.00E+3nM ΔG°: >-7.60kcal/molepH: 7.4 T: 2°C. Assay description: The Ki values were determined by the application of the Cheng-Prusoff equation: Ki = (IC50 x Kd)/(Kd+[L]) where [L] is the concentration of [3H]MIB (...
In DepthDetails ArticlePubMed