BDBM187614 US9169252, 172
SMILES CC(C)Nc1cc(ncc1C(=O)NC[C@@H](F)C(C)(C)O)-n1cnc2cnc(NCCO)nc12
InChI Key InChIKey=OUWNLGDYPZZGMX-MRXNPFEDSA-N
Data  1 IC50
  Tab Delimited (TSV)   2D SDfile   Computed 3D by Vconf -m prep SDfile
Find this compound or compounds like it in BindingDB:
Activity Spreadsheet -- Enzyme Inhibition Constant Data from BindingDB
Found 1 hit for monomerid = 187614
TargetInterleukin-1 receptor-associated kinase 4(Homo sapiens (Human))
Bristol-Myers Squibb
US Patent
LigandPNGBDBM187614(US9169252, 172)
Affinity DataIC50:  2.5nMpH: 7.2Assay Description:The assays were performed in U-bottom 384-well plates. The final assay volume was 30 L prepared from 15 L additions of enzyme and substrates (fluores...
In DepthDetails US Patent