BDBM188628 US9169246, 166
SMILES CN1CCN(CC1)c1ncccc1-c1ccc2c3[nH]ncc3c(=O)n(CC(F)(F)F)c2c1
InChI Key InChIKey=QPNBHHSRLGDNSM-UHFFFAOYSA-N
Data  1 IC50
  Tab Delimited (TSV)   2D SDfile   Computed 3D by Vconf -m prep SDfile
Find this compound or compounds like it in BindingDB:
Activity Spreadsheet -- Enzyme Inhibition Constant Data from BindingDB
Found 1 hit for monomerid = 188628
TargetMethionine aminopeptidase 2(Homo sapiens (Human))
Sanofi
US Patent
LigandPNGBDBM188628(US9169246, 166)
Affinity DataIC50:  7.24nM. Assay description: The enzymatic test is a test in two steps.In a first step, it consists in placing in contact the compound according to the invention, the dialysed Me...
In DepthDetails US Patent