BDBM189080 US9169260, 349
SMILES CN(C)C(=O)c1ccc(cc1)-c1cc(NC(=O)c2cnn3cccnc23)n(n1)-c1ccc(C)cc1
InChI Key InChIKey=ZZKGHZPSRRSSMR-UHFFFAOYSA-N
Data  1 IC50
  Tab Delimited (TSV)   2D SDfile   Computed 3D by Vconf -m prep SDfile
Find this compound or compounds like it in BindingDB:
Activity Spreadsheet -- Enzyme Inhibition Constant Data from BindingDB
Found 1 hit for monomerid = 189080
TargetInterleukin-1 receptor-associated kinase 4(Homo sapiens (Human))
Merck Sharp & Dohme
US Patent
LigandPNGBDBM189080(US9169260, 349)
Affinity DataIC50: <100nMpH: 7.2Assay Description:The kinase activity of IRAK-4 is determined by its ability to catalyze the phosphorylation of a fluorescent polypeptide substrate. The extent of phos...
In DepthDetails US Patent